public inbox for development@lists.ipfire.org
 help / color / mirror / Atom feed
From: Adolf Belka <adolf.belka@ipfire.org>
To: development@lists.ipfire.org
Subject: Problems with hyperscan when building binutils
Date: Sat, 17 Apr 2021 16:11:59 +0200	[thread overview]
Message-ID: <b2513778-4038-5c1e-249d-d452930a1c73@ipfire.org> (raw)

[-- Attachment #1: Type: text/plain, Size: 440 bytes --]

Hi All,

I was building an update of binutils. That built successfully but then hyperscan had a lot of failures. I am not able to understand what the problem is from the error messages.

Could this be related to my update of binutils?

If yes then what do I need to change?

If no then what is causing the problem?

I did a git pull origin next before I did my build of binutils.

Error log attached.


Regards,

Adolf.


[-- Warning: decoded text below may be mangled, UTF-8 assumed --]
[-- Attachment #2: _build.ipfire.log --]
[-- Type: text/x-log, Size: 46187 bytes --]

Apr 17 13:34:10: Building hyperscan hyperscan-5.4.0.tar.gz checksum OK
+ cd /usr/src/lfs
+ make -f hyperscan LFS_BASEDIR=/usr/src install
====================================== Installing hyperscan-5.4.0 ...
Install started; saving file list to /usr/src/lsalr ...
cd /usr/src/hyperscan-5.4.0 && cmake . \
	-DCMAKE_INSTALL_PREFIX:PATH=/usr \
	-DBUILD_SHARED_LIBS:BOOL=ON \
	-DBUILD_STATIC_AND_SHARED:BOOL=OFF
CMake Deprecation Warning at CMakeLists.txt:1 (cmake_minimum_required):
  Compatibility with CMake < 2.8.12 will be removed from a future version of
  CMake.

  Update the VERSION argument <min> value or use a ...<max> suffix to tell
  CMake that the project does not need compatibility with older versions.


-- The C compiler identification is GNU 10.2.0
-- The CXX compiler identification is GNU 10.2.0
-- Detecting C compiler ABI info
-- Detecting C compiler ABI info - done
-- Check for working C compiler: /tools_x86_64/ccache/bin/cc - skipped
-- Detecting C compile features
-- Detecting C compile features - done
-- Detecting CXX compiler ABI info
-- Detecting CXX compiler ABI info - done
-- Check for working CXX compiler: /tools_x86_64/ccache/bin/c++ - skipped
-- Detecting CXX compile features
-- Detecting CXX compile features - done
-- Performing Test ARCH_64_BIT
-- Performing Test ARCH_64_BIT - Success
-- Performing Test ARCH_32_BIT
-- Performing Test ARCH_32_BIT - Failed
-- Default build type 'Release with debug info'
-- using release build
-- Boost version: 1.71.0
-- Found PythonInterp: /usr/bin/python (found version "2.7.18") 
-- Build date: 2021-04-17
-- Building shared libraries
-- gcc version 10.2.0
-- g++ version 10.2.0
-- Looking for include file unistd.h
-- Looking for include file unistd.h - found
-- Looking for include file intrin.h
-- Looking for include file intrin.h - not found
-- Looking for C++ include intrin.h
-- Looking for C++ include intrin.h - not found
-- Looking for include file x86intrin.h
-- Looking for include file x86intrin.h - found
-- Looking for C++ include x86intrin.h
-- Looking for C++ include x86intrin.h - found
-- Looking for posix_memalign
-- Looking for posix_memalign - found
-- Looking for _aligned_malloc
-- Looking for _aligned_malloc - not found
-- Performing Test HAS_C_HIDDEN
-- Performing Test HAS_C_HIDDEN - Success
-- Performing Test HAS_CXX_HIDDEN
-- Performing Test HAS_CXX_HIDDEN - Success
-- Looking for _LIBCPP_VERSION
-- Looking for _LIBCPP_VERSION - not found
-- generator is Unix Makefiles
-- Performing Test HAS_C_ATTR_IFUNC
-- Performing Test HAS_C_ATTR_IFUNC - Success
-- Performing Test HAVE_SSSE3
-- Performing Test HAVE_SSSE3 - Success
-- Performing Test HAVE_AVX2
-- Performing Test HAVE_AVX2 - Success
-- Performing Test HAVE_AVX512
-- Performing Test HAVE_AVX512 - Failed
-- Performing Test HAVE_AVX512VBMI
-- Performing Test HAVE_AVX512VBMI - Failed
-- Performing Test HAVE_CC_BUILTIN_ASSUME_ALIGNED
-- Performing Test HAVE_CC_BUILTIN_ASSUME_ALIGNED - Success
-- Performing Test HAVE_CXX_BUILTIN_ASSUME_ALIGNED
-- Performing Test HAVE_CXX_BUILTIN_ASSUME_ALIGNED - Success
-- Performing Test HAVE__BUILTIN_CONSTANT_P
-- Performing Test HAVE__BUILTIN_CONSTANT_P - Success
-- Performing Test C_FLAG_Wvla
-- Performing Test C_FLAG_Wvla - Success
-- Performing Test C_FLAG_Wpointer_arith
-- Performing Test C_FLAG_Wpointer_arith - Success
-- Performing Test C_FLAG_Wstrict_prototypes
-- Performing Test C_FLAG_Wstrict_prototypes - Success
-- Performing Test C_FLAG_Wmissing_prototypes
-- Performing Test C_FLAG_Wmissing_prototypes - Success
-- Performing Test CXX_FLAG_Wvla
-- Performing Test CXX_FLAG_Wvla - Success
-- Performing Test CXX_FLAG_Wpointer_arith
-- Performing Test CXX_FLAG_Wpointer_arith - Success
-- Performing Test CC_SELF_ASSIGN
-- Performing Test CC_SELF_ASSIGN - Failed
-- Performing Test CXX_SELF_ASSIGN
-- Performing Test CXX_SELF_ASSIGN - Failed
-- Performing Test CC_PAREN_EQUALITY
-- Performing Test CC_PAREN_EQUALITY - Failed
-- Performing Test CXX_UNUSED_CONST_VAR
-- Performing Test CXX_UNUSED_CONST_VAR - Success
-- Performing Test CXX_IGNORED_ATTR
-- Performing Test CXX_IGNORED_ATTR - Success
-- Performing Test CXX_REDUNDANT_MOVE
-- Performing Test CXX_REDUNDANT_MOVE - Success
-- Performing Test CXX_WEAK_VTABLES
-- Performing Test CXX_WEAK_VTABLES - Failed
-- Performing Test CXX_MISSING_DECLARATIONS
-- Performing Test CXX_MISSING_DECLARATIONS - Success
-- Performing Test CXX_UNUSED_LOCAL_TYPEDEFS
-- Performing Test CXX_UNUSED_LOCAL_TYPEDEFS - Success
-- Performing Test CXX_WUNUSED_VARIABLE
-- Performing Test CXX_WUNUSED_VARIABLE - Success
-- Performing Test CC_STRINGOP_OVERFLOW
-- Performing Test CC_STRINGOP_OVERFLOW - Success
-- Building runtime for multiple microarchitectures
-- Looking for mmap
-- Looking for mmap - found
-- Doxygen not found, unable to generate API reference
-- Sphinx not found, unable to generate developer reference
-- Found PkgConfig: /usr/bin/pkg-config (found version "0.29.2") 
-- Checking for module 'libpcre>=8.41'
--   Found libpcre, version 8.44
-- PCRE version 8.41 or above
-- Looking for pthread.h
-- Looking for pthread.h - found
-- Performing Test CMAKE_HAVE_LIBC_PTHREAD
-- Performing Test CMAKE_HAVE_LIBC_PTHREAD - Failed
-- Looking for pthread_create in pthreads
-- Looking for pthread_create in pthreads - not found
-- Looking for pthread_create in pthread
-- Looking for pthread_create in pthread - found
-- Found Threads: TRUE  
-- Checking for module 'sqlite3'
--   Found sqlite3, version 3.35.4
-- Performing Test SQLITE_VERSION_OK
-- Performing Test SQLITE_VERSION_OK - Success
-- Looking for sqlite3_open_v2
-- Looking for sqlite3_open_v2 - found
-- Looking for C++ include pthread_np.h
-- Looking for C++ include pthread_np.h - not found
-- Looking for pthread_setaffinity_np
-- Looking for pthread_setaffinity_np - found
-- Looking for malloc_info
-- Looking for malloc_info - found
-- Looking for shmget
-- Looking for shmget - found
-- Performing Test BACKTRACE_LIBC
-- Performing Test BACKTRACE_LIBC - Success
-- Performing Test HAS_RDYNAMIC
-- Performing Test HAS_RDYNAMIC - Success
-- Configuring done
CMake Warning (dev) at CMakeLists.txt:1276 (add_library):
  Policy CMP0115 is not set: Source file extensions must be explicit.  Run
  "cmake --help-policy CMP0115" for policy details.  Use the cmake_policy
  command to set the policy and suppress this warning.

  File:

    /usr/src/hyperscan-5.4.0/src/hs_version.h.in
This warning is for project developers.  Use -Wno-dev to suppress it.

-- Generating done
-- Build files have been written to: /usr/src/hyperscan-5.4.0
cd /usr/src/hyperscan-5.4.0 && make -j7
make[1]: Entering directory '/usr/src/hyperscan-5.4.0'
make[2]: Entering directory '/usr/src/hyperscan-5.4.0'
make[3]: Entering directory '/usr/src/hyperscan-5.4.0'
make[3]: Entering directory '/usr/src/hyperscan-5.4.0'
make[3]: Entering directory '/usr/src/hyperscan-5.4.0'
make[3]: Entering directory '/usr/src/hyperscan-5.4.0'
make[3]: Entering directory '/usr/src/hyperscan-5.4.0'
make[3]: Entering directory '/usr/src/hyperscan-5.4.0'
make[3]: Entering directory '/usr/src/hyperscan-5.4.0'
make[3]: Leaving directory '/usr/src/hyperscan-5.4.0'
make[3]: Leaving directory '/usr/src/hyperscan-5.4.0'
make[3]: Leaving directory '/usr/src/hyperscan-5.4.0'
make[3]: Leaving directory '/usr/src/hyperscan-5.4.0'
[  0%] Generating src/parser/control_verbs.cpp
make[3]: Leaving directory '/usr/src/hyperscan-5.4.0'
make[3]: Entering directory '/usr/src/hyperscan-5.4.0'
make[3]: Entering directory '/usr/src/hyperscan-5.4.0'
make[3]: Entering directory '/usr/src/hyperscan-5.4.0'
make[3]: Entering directory '/usr/src/hyperscan-5.4.0'
make[3]: Entering directory '/usr/src/hyperscan-5.4.0'
make[3]: Leaving directory '/usr/src/hyperscan-5.4.0'
[  0%] Building C object CMakeFiles/hs_exec_shared_core2.dir/src/crc32.c.o
[  0%] Building C object CMakeFiles/hs_exec_shared_avx2.dir/src/crc32.c.o
make[3]: Entering directory '/usr/src/hyperscan-5.4.0'
[  1%] Generating src/parser/Parser.cpp
[  1%] Building C object CMakeFiles/hs_exec_shared_corei7.dir/src/crc32.c.o
[  1%] Building C object CMakeFiles/hs_exec_common_shared.dir/src/alloc.c.o
[  1%] Building CXX object util/CMakeFiles/crosscompileutil.dir/cross_compile.cpp.o
[  2%] Generating src/parser/Parser.cpp
[  2%] Building C object CMakeFiles/hs_exec_common_shared.dir/src/scratch.c.o
make[3]: Leaving directory '/usr/src/hyperscan-5.4.0'
[  2%] Built target ragel_Parser
[  3%] Building C object CMakeFiles/hs_exec_shared_core2.dir/src/runtime.c.o
make[3]: Leaving directory '/usr/src/hyperscan-5.4.0'
[  4%] Linking CXX static library ../lib/libcrosscompileutil.a
make[3]: Leaving directory '/usr/src/hyperscan-5.4.0'
[  4%] Building C object CMakeFiles/hs_exec_common_shared.dir/src/util/cpuid_flags.c.o
[  5%] Building C object CMakeFiles/hs_exec_common_shared.dir/src/util/multibit.c.o
[  5%] Building C object CMakeFiles/hs_exec_shared_core2.dir/src/stream_compress.c.o
[  5%] Building C object CMakeFiles/hs_exec_common_shared.dir/src/dispatcher.c.o
[  5%] Building C object CMakeFiles/hs_exec_shared_corei7.dir/src/runtime.c.o
[  6%] Building C object CMakeFiles/hs_exec_shared_avx2.dir/src/runtime.c.o
make[3]: Leaving directory '/usr/src/hyperscan-5.4.0'
[  6%] Building C object CMakeFiles/hs_exec_shared_core2.dir/src/fdr/fdr.c.o
[  7%] Building C object CMakeFiles/hs_exec_shared_core2.dir/src/fdr/teddy.c.o
[  8%] Building C object CMakeFiles/hs_exec_shared_corei7.dir/src/stream_compress.c.o
[  8%] Building C object CMakeFiles/hs_exec_shared_core2.dir/src/hwlm/hwlm.c.o
[  8%] Building C object CMakeFiles/hs_exec_shared_avx2.dir/src/stream_compress.c.o
[  8%] Building C object CMakeFiles/hs_exec_shared_core2.dir/src/hwlm/noodle_engine.c.o
[  8%] Building C object CMakeFiles/hs_exec_shared_corei7.dir/src/fdr/fdr.c.o
[  8%] Building C object CMakeFiles/hs_exec_shared_corei7.dir/src/fdr/teddy.c.o
[  8%] Building C object CMakeFiles/hs_exec_shared_avx2.dir/src/fdr/fdr.c.o
[  8%] Building C object CMakeFiles/hs_exec_shared_core2.dir/src/nfa/accel.c.o
[  8%] Building C object CMakeFiles/hs_exec_shared_corei7.dir/src/hwlm/hwlm.c.o
[  9%] Building C object CMakeFiles/hs_exec_shared_corei7.dir/src/hwlm/noodle_engine.c.o
[  9%] Building C object CMakeFiles/hs_exec_shared_avx2.dir/src/fdr/teddy.c.o
[ 10%] Building C object CMakeFiles/hs_exec_shared_core2.dir/src/nfa/castle.c.o
[ 10%] Building C object CMakeFiles/hs_exec_shared_corei7.dir/src/nfa/accel.c.o
[ 11%] Building C object CMakeFiles/hs_exec_shared_avx2.dir/src/hwlm/hwlm.c.o
make[3]: Entering directory '/usr/src/hyperscan-5.4.0'
make[3]: Entering directory '/usr/src/hyperscan-5.4.0'
[ 11%] Built target hs_exec_common_shared
[ 11%] Built target crosscompileutil
make[3]: Leaving directory '/usr/src/hyperscan-5.4.0'
make[3]: Entering directory '/usr/src/hyperscan-5.4.0'
make[3]: Entering directory '/usr/src/hyperscan-5.4.0'
[ 11%] Building CXX object CMakeFiles/hs_compile_shared.dir/src/grey.cpp.o
[ 11%] Building CXX object CMakeFiles/hs_compile_shared.dir/src/hs.cpp.o
[ 11%] Building CXX object util/CMakeFiles/databaseutil.dir/database_util.cpp.o
make[3]: Leaving directory '/usr/src/hyperscan-5.4.0'
make[3]: Entering directory '/usr/src/hyperscan-5.4.0'
[ 11%] Building CXX object util/CMakeFiles/corpusomatic.dir/ng_corpus_editor.cpp.o
[ 12%] Building CXX object CMakeFiles/hs_compile_shared.dir/src/compiler/asserts.cpp.o
[ 12%] Linking CXX static library ../lib/libdatabaseutil.a
[ 12%] Building C object CMakeFiles/hs_exec_shared_core2.dir/src/nfa/gough.c.o
make[3]: Leaving directory '/usr/src/hyperscan-5.4.0'
[ 12%] Built target databaseutil
[ 12%] Building C object CMakeFiles/hs_exec_shared_core2.dir/src/nfa/lbr.c.o
[ 12%] Building CXX object util/CMakeFiles/corpusomatic.dir/ng_corpus_generator.cpp.o
[ 12%] Building C object CMakeFiles/hs_exec_shared_avx2.dir/src/hwlm/noodle_engine.c.o
[ 12%] Building C object CMakeFiles/hs_exec_shared_corei7.dir/src/nfa/castle.c.o
[ 13%] Building C object CMakeFiles/hs_exec_shared_core2.dir/src/nfa/limex_accel.c.o
[ 14%] Building C object CMakeFiles/hs_exec_shared_corei7.dir/src/nfa/gough.c.o
[ 14%] Building C object CMakeFiles/hs_exec_shared_avx2.dir/src/nfa/accel.c.o
[ 14%] Building C object CMakeFiles/hs_exec_shared_core2.dir/src/nfa/limex_native.c.o
[ 14%] Building C object CMakeFiles/hs_exec_shared_corei7.dir/src/nfa/lbr.c.o
[ 14%] Building C object CMakeFiles/hs_exec_shared_corei7.dir/src/nfa/limex_accel.c.o
[ 14%] Building C object CMakeFiles/hs_exec_shared_core2.dir/src/nfa/limex_64.c.o
[ 15%] Building C object CMakeFiles/hs_exec_shared_avx2.dir/src/nfa/castle.c.o
[ 15%] Building C object CMakeFiles/hs_exec_shared_corei7.dir/src/nfa/limex_native.c.o
[ 16%] Building C object CMakeFiles/hs_exec_shared_corei7.dir/src/nfa/limex_64.c.o
[ 16%] Building C object CMakeFiles/hs_exec_shared_corei7.dir/src/nfa/limex_simd128.c.o
[ 16%] Building C object CMakeFiles/hs_exec_shared_avx2.dir/src/nfa/gough.c.o
[ 16%] Building C object CMakeFiles/hs_exec_shared_core2.dir/src/nfa/limex_simd128.c.o
[ 16%] Building C object CMakeFiles/hs_exec_shared_corei7.dir/src/nfa/limex_simd256.c.o
[ 16%] Building C object CMakeFiles/hs_exec_shared_avx2.dir/src/nfa/lbr.c.o
[ 16%] Building CXX object util/CMakeFiles/corpusomatic.dir/ng_corpus_properties.cpp.o
[ 17%] Building C object CMakeFiles/hs_exec_shared_corei7.dir/src/nfa/limex_simd384.c.o
[ 18%] Building C object CMakeFiles/hs_exec_shared_core2.dir/src/nfa/limex_simd256.c.o
[ 18%] Building C object CMakeFiles/hs_exec_shared_corei7.dir/src/nfa/limex_simd512.c.o
[ 18%] Building C object CMakeFiles/hs_exec_shared_corei7.dir/src/nfa/mcclellan.c.o
[ 18%] Building C object CMakeFiles/hs_exec_shared_avx2.dir/src/nfa/limex_accel.c.o
[ 19%] Building CXX object util/CMakeFiles/corpusomatic.dir/ng_find_matches.cpp.o
[ 19%] Building CXX object CMakeFiles/hs_compile_shared.dir/src/compiler/compiler.cpp.o
[ 19%] Building C object CMakeFiles/hs_exec_shared_corei7.dir/src/nfa/mcsheng.c.o
[ 19%] Building C object CMakeFiles/hs_exec_shared_core2.dir/src/nfa/limex_simd384.c.o
[ 20%] Building C object CMakeFiles/hs_exec_shared_corei7.dir/src/nfa/mcsheng_data.c.o
[ 20%] Linking CXX static library ../lib/libcorpusomatic.a
[ 20%] Building C object CMakeFiles/hs_exec_shared_corei7.dir/src/nfa/mpv.c.o
make[3]: Leaving directory '/usr/src/hyperscan-5.4.0'
[ 20%] Built target corpusomatic
make[3]: Entering directory '/usr/src/hyperscan-5.4.0'
make[3]: Leaving directory '/usr/src/hyperscan-5.4.0'
make[3]: Entering directory '/usr/src/hyperscan-5.4.0'
[ 20%] Generating ExpressionParser.cpp
make[3]: Leaving directory '/usr/src/hyperscan-5.4.0'
[ 20%] Built target ragel_ExpressionParser
make[3]: Entering directory '/usr/src/hyperscan-5.4.0'
make[3]: Leaving directory '/usr/src/hyperscan-5.4.0'
make[3]: Entering directory '/usr/src/hyperscan-5.4.0'
[ 21%] Building CXX object util/CMakeFiles/expressionutil.dir/expressions.cpp.o
[ 21%] Building C object CMakeFiles/hs_exec_shared_corei7.dir/src/nfa/nfa_api_dispatch.c.o
[ 21%] Building C object CMakeFiles/hs_exec_shared_core2.dir/src/nfa/limex_simd512.c.o
[ 22%] Building C object CMakeFiles/hs_exec_shared_core2.dir/src/nfa/mcclellan.c.o
[ 22%] Building CXX object util/CMakeFiles/expressionutil.dir/ExpressionParser.cpp.o
[ 22%] Linking CXX static library ../lib/libexpressionutil.a
make[3]: Leaving directory '/usr/src/hyperscan-5.4.0'
[ 22%] Building C object CMakeFiles/hs_exec_shared_core2.dir/src/nfa/mcsheng.c.o
[ 22%] Built target expressionutil
[ 23%] Building C object CMakeFiles/hs_exec_shared_corei7.dir/src/nfa/repeat.c.o
[ 23%] Building C object CMakeFiles/hs_exec_shared_corei7.dir/src/nfa/sheng.c.o
[ 23%] Building C object CMakeFiles/hs_exec_shared_core2.dir/src/nfa/mcsheng_data.c.o
[ 24%] Building C object CMakeFiles/hs_exec_shared_corei7.dir/src/nfa/shufti.c.o
[ 24%] Building C object CMakeFiles/hs_exec_shared_avx2.dir/src/nfa/limex_native.c.o
[ 24%] Building C object CMakeFiles/hs_exec_shared_avx2.dir/src/nfa/limex_64.c.o
[ 24%] Building C object CMakeFiles/hs_exec_shared_corei7.dir/src/nfa/tamarama.c.o
[ 25%] Building C object CMakeFiles/hs_exec_shared_corei7.dir/src/nfa/truffle.c.o
[ 25%] Building C object CMakeFiles/hs_exec_shared_avx2.dir/src/nfa/limex_simd128.c.o
[ 25%] Building C object CMakeFiles/hs_exec_shared_core2.dir/src/nfa/mpv.c.o
[ 26%] Building C object CMakeFiles/hs_exec_shared_core2.dir/src/nfa/nfa_api_dispatch.c.o
[ 26%] Building C object CMakeFiles/hs_exec_shared_corei7.dir/src/som/som_runtime.c.o
[ 26%] Building C object CMakeFiles/hs_exec_shared_corei7.dir/src/som/som_stream.c.o
[ 27%] Building C object CMakeFiles/hs_exec_shared_corei7.dir/src/rose/block.c.o
[ 27%] Building C object CMakeFiles/hs_exec_shared_core2.dir/src/nfa/repeat.c.o
[ 28%] Building C object CMakeFiles/hs_exec_shared_avx2.dir/src/nfa/limex_simd256.c.o
[ 28%] Building C object CMakeFiles/hs_exec_shared_core2.dir/src/nfa/sheng.c.o
[ 29%] Building C object CMakeFiles/hs_exec_shared_core2.dir/src/nfa/shufti.c.o
[ 29%] Building C object CMakeFiles/hs_exec_shared_avx2.dir/src/nfa/limex_simd384.c.o
[ 29%] Building C object CMakeFiles/hs_exec_shared_corei7.dir/src/rose/catchup.c.o
[ 29%] Building C object CMakeFiles/hs_exec_shared_avx2.dir/src/nfa/limex_simd512.c.o
[ 29%] Building C object CMakeFiles/hs_exec_shared_avx2.dir/src/nfa/mcclellan.c.o
[ 30%] Building C object CMakeFiles/hs_exec_shared_avx2.dir/src/nfa/mcsheng.c.o
[ 30%] Building C object CMakeFiles/hs_exec_shared_core2.dir/src/nfa/tamarama.c.o
[ 30%] Building C object CMakeFiles/hs_exec_shared_avx2.dir/src/nfa/mcsheng_data.c.o
[ 30%] Building C object CMakeFiles/hs_exec_shared_core2.dir/src/nfa/truffle.c.o
[ 30%] Building C object CMakeFiles/hs_exec_shared_avx2.dir/src/nfa/mpv.c.o
[ 30%] Building C object CMakeFiles/hs_exec_shared_core2.dir/src/som/som_runtime.c.o
[ 31%] Building C object CMakeFiles/hs_exec_shared_avx2.dir/src/nfa/nfa_api_dispatch.c.o
[ 32%] Building C object CMakeFiles/hs_exec_shared_core2.dir/src/som/som_stream.c.o
[ 32%] Building C object CMakeFiles/hs_exec_shared_core2.dir/src/rose/block.c.o
[ 32%] Building C object CMakeFiles/hs_exec_shared_core2.dir/src/rose/catchup.c.o
[ 32%] Building C object CMakeFiles/hs_exec_shared_avx2.dir/src/nfa/repeat.c.o
[ 33%] Building C object CMakeFiles/hs_exec_shared_core2.dir/src/rose/stream.c.o
[ 33%] Building C object CMakeFiles/hs_exec_shared_core2.dir/src/rose/init.c.o
[ 33%] Building C object CMakeFiles/hs_exec_shared_avx2.dir/src/nfa/sheng.c.o
[ 33%] Building C object CMakeFiles/hs_exec_shared_core2.dir/src/rose/match.c.o
[ 33%] Building C object CMakeFiles/hs_exec_shared_corei7.dir/src/rose/stream.c.o
[ 33%] Building C object CMakeFiles/hs_exec_shared_corei7.dir/src/rose/init.c.o
[ 33%] Building C object CMakeFiles/hs_exec_shared_core2.dir/src/rose/program_runtime.c.o
[ 34%] Building C object CMakeFiles/hs_exec_shared_core2.dir/src/util/multibit.c.o
[ 34%] Building C object CMakeFiles/hs_exec_shared_avx2.dir/src/nfa/shufti.c.o
[ 35%] Building C object CMakeFiles/hs_exec_shared_corei7.dir/src/rose/match.c.o
[ 35%] Building C object CMakeFiles/hs_exec_shared_corei7.dir/src/rose/program_runtime.c.o
[ 36%] Building C object CMakeFiles/hs_exec_shared_avx2.dir/src/nfa/tamarama.c.o
[ 36%] Building C object CMakeFiles/hs_exec_shared_core2.dir/src/util/simd_utils.c.o
[ 36%] Building C object CMakeFiles/hs_exec_shared_avx2.dir/src/nfa/truffle.c.o
[ 36%] Building C object CMakeFiles/hs_exec_shared_core2.dir/src/util/state_compress.c.o
[ 37%] Building CXX object CMakeFiles/hs_compile_shared.dir/src/compiler/error.cpp.o
[ 37%] Building CXX object CMakeFiles/hs_compile_shared.dir/src/fdr/engine_description.cpp.o
[ 37%] Building CXX object CMakeFiles/hs_compile_shared.dir/src/fdr/fdr_compile.cpp.o
[ 37%] Building CXX object CMakeFiles/hs_compile_shared.dir/src/fdr/fdr_compile_util.cpp.o
[ 37%] Building CXX object CMakeFiles/hs_compile_shared.dir/src/fdr/fdr_confirm_compile.cpp.o
[ 39%] Building C object CMakeFiles/hs_exec_shared_core2.dir/src/database.c.o
[ 39%] Building C object CMakeFiles/hs_exec_shared_corei7.dir/src/util/multibit.c.o
[ 39%] Building C object CMakeFiles/hs_exec_shared_corei7.dir/src/util/simd_utils.c.o
[ 40%] Building CXX object CMakeFiles/hs_compile_shared.dir/src/fdr/fdr_engine_description.cpp.o
[ 40%] Building C object CMakeFiles/hs_exec_shared_avx2.dir/src/som/som_runtime.c.o
[ 40%] Building CXX object CMakeFiles/hs_compile_shared.dir/src/fdr/flood_compile.cpp.o
[ 40%] Building CXX object CMakeFiles/hs_compile_shared.dir/src/fdr/teddy_compile.cpp.o
[ 41%] Building CXX object CMakeFiles/hs_compile_shared.dir/src/fdr/teddy_engine_description.cpp.o
[ 41%] Building CXX object CMakeFiles/hs_compile_shared.dir/src/hwlm/hwlm_build.cpp.o
[ 42%] Building C object CMakeFiles/hs_exec_shared_avx2.dir/src/som/som_stream.c.o
[ 42%] Building C object CMakeFiles/hs_exec_shared_corei7.dir/src/util/state_compress.c.o
[ 42%] Building CXX object CMakeFiles/hs_compile_shared.dir/src/hwlm/hwlm_literal.cpp.o
[ 42%] Building C object CMakeFiles/hs_exec_shared_avx2.dir/src/rose/block.c.o
[ 42%] Building C object CMakeFiles/hs_exec_shared_corei7.dir/src/database.c.o
[ 42%] Building CXX object CMakeFiles/hs_compile_shared.dir/src/hwlm/noodle_build.cpp.o
make[3]: Leaving directory '/usr/src/hyperscan-5.4.0'
[ 42%] Building C object CMakeFiles/hs_exec_shared_avx2.dir/src/rose/catchup.c.o
[ 42%] Built target hs_exec_shared_core2
[ 43%] Building CXX object CMakeFiles/hs_compile_shared.dir/src/nfa/accel_dfa_build_strat.cpp.o
[ 43%] Building CXX object CMakeFiles/hs_compile_shared.dir/src/nfa/accelcompile.cpp.o
[ 43%] Building CXX object CMakeFiles/hs_compile_shared.dir/src/nfa/castlecompile.cpp.o
[ 43%] Building C object CMakeFiles/hs_exec_shared_avx2.dir/src/rose/init.c.o
[ 44%] Building C object CMakeFiles/hs_exec_shared_avx2.dir/src/rose/stream.c.o
[ 44%] Building C object CMakeFiles/hs_exec_shared_avx2.dir/src/rose/match.c.o
[ 45%] Building CXX object CMakeFiles/hs_compile_shared.dir/src/nfa/dfa_build_strat.cpp.o
[ 45%] Building CXX object CMakeFiles/hs_compile_shared.dir/src/nfa/dfa_min.cpp.o
[ 45%] Building CXX object CMakeFiles/hs_compile_shared.dir/src/nfa/goughcompile.cpp.o
[ 45%] Building CXX object CMakeFiles/hs_compile_shared.dir/src/nfa/goughcompile_accel.cpp.o
make[3]: Leaving directory '/usr/src/hyperscan-5.4.0'
[ 45%] Built target hs_exec_shared_corei7
[ 46%] Building CXX object CMakeFiles/hs_compile_shared.dir/src/nfa/goughcompile_reg.cpp.o
[ 46%] Building C object CMakeFiles/hs_exec_shared_avx2.dir/src/rose/program_runtime.c.o
[ 47%] Building C object CMakeFiles/hs_exec_shared_avx2.dir/src/util/multibit.c.o
[ 47%] Building CXX object CMakeFiles/hs_compile_shared.dir/src/nfa/mcclellancompile.cpp.o
[ 47%] Building C object CMakeFiles/hs_exec_shared_avx2.dir/src/util/simd_utils.c.o
[ 47%] Building CXX object CMakeFiles/hs_compile_shared.dir/src/nfa/mcclellancompile_util.cpp.o
[ 48%] Building CXX object CMakeFiles/hs_compile_shared.dir/src/nfa/mcsheng_compile.cpp.o
[ 48%] Building C object CMakeFiles/hs_exec_shared_avx2.dir/src/util/state_compress.c.o
[ 48%] Building CXX object CMakeFiles/hs_compile_shared.dir/src/nfa/limex_compile.cpp.o
[ 48%] Building CXX object CMakeFiles/hs_compile_shared.dir/src/nfa/mpvcompile.cpp.o
[ 49%] Building CXX object CMakeFiles/hs_compile_shared.dir/src/nfa/nfa_build_util.cpp.o
[ 49%] Building CXX object CMakeFiles/hs_compile_shared.dir/src/nfa/rdfa.cpp.o
[ 49%] Building CXX object CMakeFiles/hs_compile_shared.dir/src/nfa/rdfa_graph.cpp.o
[ 49%] Building CXX object CMakeFiles/hs_compile_shared.dir/src/nfa/rdfa_merge.cpp.o
[ 50%] Building CXX object CMakeFiles/hs_compile_shared.dir/src/nfa/repeatcompile.cpp.o
[ 50%] Building CXX object CMakeFiles/hs_compile_shared.dir/src/nfa/shengcompile.cpp.o
[ 50%] Building CXX object CMakeFiles/hs_compile_shared.dir/src/nfa/shufticompile.cpp.o
[ 51%] Building CXX object CMakeFiles/hs_compile_shared.dir/src/nfa/tamaramacompile.cpp.o
[ 51%] Building CXX object CMakeFiles/hs_compile_shared.dir/src/nfa/trufflecompile.cpp.o
[ 51%] Building CXX object CMakeFiles/hs_compile_shared.dir/src/nfagraph/ng.cpp.o
[ 51%] Building CXX object CMakeFiles/hs_compile_shared.dir/src/nfagraph/ng_anchored_acyclic.cpp.o
[ 52%] Building CXX object CMakeFiles/hs_compile_shared.dir/src/nfagraph/ng_anchored_dots.cpp.o
[ 52%] Building CXX object CMakeFiles/hs_compile_shared.dir/src/nfagraph/ng_asserts.cpp.o
[ 52%] Building CXX object CMakeFiles/hs_compile_shared.dir/src/nfagraph/ng_builder.cpp.o
[ 53%] Building CXX object CMakeFiles/hs_compile_shared.dir/src/nfagraph/ng_calc_components.cpp.o
[ 53%] Building CXX object CMakeFiles/hs_compile_shared.dir/src/nfagraph/ng_cyclic_redundancy.cpp.o
[ 53%] Building CXX object CMakeFiles/hs_compile_shared.dir/src/nfagraph/ng_depth.cpp.o
[ 53%] Building CXX object CMakeFiles/hs_compile_shared.dir/src/nfagraph/ng_dominators.cpp.o
[ 54%] Building CXX object CMakeFiles/hs_compile_shared.dir/src/nfagraph/ng_edge_redundancy.cpp.o
[ 54%] Building CXX object CMakeFiles/hs_compile_shared.dir/src/nfagraph/ng_equivalence.cpp.o
[ 54%] Building CXX object CMakeFiles/hs_compile_shared.dir/src/nfagraph/ng_execute.cpp.o
[ 55%] Building CXX object CMakeFiles/hs_compile_shared.dir/src/nfagraph/ng_expr_info.cpp.o
[ 55%] Building CXX object CMakeFiles/hs_compile_shared.dir/src/nfagraph/ng_extparam.cpp.o
[ 55%] Building CXX object CMakeFiles/hs_compile_shared.dir/src/nfagraph/ng_fixed_width.cpp.o
[ 55%] Building CXX object CMakeFiles/hs_compile_shared.dir/src/nfagraph/ng_fuzzy.cpp.o
[ 56%] Building CXX object CMakeFiles/hs_compile_shared.dir/src/nfagraph/ng_haig.cpp.o
[ 57%] Building CXX object CMakeFiles/hs_compile_shared.dir/src/nfagraph/ng_holder.cpp.o
[ 57%] Building C object CMakeFiles/hs_exec_shared_avx2.dir/src/fdr/teddy_avx2.c.o
[ 57%] Building C object CMakeFiles/hs_exec_shared_avx2.dir/src/util/masked_move.c.o
[ 57%] Building C object CMakeFiles/hs_exec_shared_avx2.dir/src/database.c.o
[ 57%] Building CXX object CMakeFiles/hs_compile_shared.dir/src/nfagraph/ng_is_equal.cpp.o
[ 58%] Building CXX object CMakeFiles/hs_compile_shared.dir/src/nfagraph/ng_lbr.cpp.o
[ 58%] Building CXX object CMakeFiles/hs_compile_shared.dir/src/nfagraph/ng_literal_analysis.cpp.o
[ 58%] Building CXX object CMakeFiles/hs_compile_shared.dir/src/nfagraph/ng_literal_component.cpp.o
[ 58%] Building CXX object CMakeFiles/hs_compile_shared.dir/src/nfagraph/ng_literal_decorated.cpp.o
[ 59%] Building CXX object CMakeFiles/hs_compile_shared.dir/src/nfagraph/ng_mcclellan.cpp.o
[ 59%] Building CXX object CMakeFiles/hs_compile_shared.dir/src/nfagraph/ng_limex.cpp.o
[ 59%] Building CXX object CMakeFiles/hs_compile_shared.dir/src/nfagraph/ng_limex_accel.cpp.o
[ 60%] Building CXX object CMakeFiles/hs_compile_shared.dir/src/nfagraph/ng_misc_opt.cpp.o
[ 60%] Building CXX object CMakeFiles/hs_compile_shared.dir/src/nfagraph/ng_netflow.cpp.o
make[3]: Leaving directory '/usr/src/hyperscan-5.4.0'
[ 60%] Built target hs_exec_shared_avx2
make[3]: Entering directory '/usr/src/hyperscan-5.4.0'
make[3]: Leaving directory '/usr/src/hyperscan-5.4.0'
make[3]: Entering directory '/usr/src/hyperscan-5.4.0'
[ 60%] Building CXX object CMakeFiles/hs_compile_shared.dir/src/nfagraph/ng_prefilter.cpp.o
[ 60%] Building CXX object CMakeFiles/hs_compile_shared.dir/src/nfagraph/ng_prune.cpp.o
[ 60%] Building C object CMakeFiles/hs_runtime_shared.dir/src/hs_version.c.o
[ 61%] Building CXX object CMakeFiles/hs_compile_shared.dir/src/nfagraph/ng_puff.cpp.o
[ 61%] Building CXX object CMakeFiles/hs_compile_shared.dir/src/nfagraph/ng_redundancy.cpp.o
[ 61%] Building CXX object CMakeFiles/hs_compile_shared.dir/src/nfagraph/ng_region.cpp.o
[ 62%] Building CXX object CMakeFiles/hs_compile_shared.dir/src/nfagraph/ng_region_redundancy.cpp.o
[ 62%] Building CXX object CMakeFiles/hs_compile_shared.dir/src/nfagraph/ng_repeat.cpp.o
[ 62%] Building CXX object CMakeFiles/hs_compile_shared.dir/src/nfagraph/ng_reports.cpp.o
[ 63%] Building CXX object CMakeFiles/hs_compile_shared.dir/src/nfagraph/ng_restructuring.cpp.o
[ 63%] Building CXX object CMakeFiles/hs_compile_shared.dir/src/nfagraph/ng_revacc.cpp.o
[ 63%] Building CXX object CMakeFiles/hs_compile_shared.dir/src/nfagraph/ng_sep.cpp.o
[ 63%] Building CXX object CMakeFiles/hs_compile_shared.dir/src/nfagraph/ng_small_literal_set.cpp.o
[ 64%] Building CXX object CMakeFiles/hs_compile_shared.dir/src/nfagraph/ng_som.cpp.o
[ 64%] Building CXX object CMakeFiles/hs_compile_shared.dir/src/nfagraph/ng_som_add_redundancy.cpp.o
[ 64%] Building CXX object CMakeFiles/hs_compile_shared.dir/src/nfagraph/ng_som_util.cpp.o
[ 65%] Building CXX object CMakeFiles/hs_compile_shared.dir/src/nfagraph/ng_split.cpp.o
[ 65%] Building CXX object CMakeFiles/hs_compile_shared.dir/src/nfagraph/ng_squash.cpp.o
[ 65%] Building CXX object CMakeFiles/hs_compile_shared.dir/src/nfagraph/ng_stop.cpp.o
[ 65%] Building CXX object CMakeFiles/hs_compile_shared.dir/src/nfagraph/ng_uncalc_components.cpp.o
[ 66%] Building CXX object CMakeFiles/hs_compile_shared.dir/src/nfagraph/ng_utf8.cpp.o
[ 67%] Building C object CMakeFiles/hs_runtime_shared.dir/src/hs_valid_platform.c.o
[ 67%] Building CXX object CMakeFiles/hs_compile_shared.dir/src/nfagraph/ng_util.cpp.o
[ 67%] Building CXX object CMakeFiles/hs_compile_shared.dir/src/nfagraph/ng_vacuous.cpp.o
[ 68%] Building CXX object CMakeFiles/hs_compile_shared.dir/src/nfagraph/ng_violet.cpp.o
[ 68%] Linking C shared library lib/libhs_runtime.so
[ 68%] Building CXX object CMakeFiles/hs_compile_shared.dir/src/nfagraph/ng_width.cpp.o
[ 68%] Building CXX object CMakeFiles/hs_compile_shared.dir/src/parser/AsciiComponentClass.cpp.o
[ 68%] Building CXX object CMakeFiles/hs_compile_shared.dir/src/parser/Component.cpp.o
[ 69%] Building CXX object CMakeFiles/hs_compile_shared.dir/src/parser/ComponentAlternation.cpp.o
[ 69%] Building CXX object CMakeFiles/hs_compile_shared.dir/src/parser/ComponentAssertion.cpp.o
[ 69%] Building CXX object CMakeFiles/hs_compile_shared.dir/src/parser/ComponentAtomicGroup.cpp.o
[ 70%] Building CXX object CMakeFiles/hs_compile_shared.dir/src/parser/ComponentBackReference.cpp.o
[ 70%] Building CXX object CMakeFiles/hs_compile_shared.dir/src/parser/ComponentBoundary.cpp.o
[ 70%] Building CXX object CMakeFiles/hs_compile_shared.dir/src/parser/ComponentByte.cpp.o
make[3]: Leaving directory '/usr/src/hyperscan-5.4.0'
[ 70%] Built target hs_runtime_shared
[ 70%] Building CXX object CMakeFiles/hs_compile_shared.dir/src/parser/ComponentClass.cpp.o
[ 71%] Building CXX object CMakeFiles/hs_compile_shared.dir/src/parser/ComponentCondReference.cpp.o
[ 71%] Building CXX object CMakeFiles/hs_compile_shared.dir/src/parser/ComponentEUS.cpp.o
[ 71%] Building CXX object CMakeFiles/hs_compile_shared.dir/src/parser/ComponentEmpty.cpp.o
[ 72%] Building CXX object CMakeFiles/hs_compile_shared.dir/src/parser/ComponentRepeat.cpp.o
[ 72%] Building CXX object CMakeFiles/hs_compile_shared.dir/src/parser/ComponentSequence.cpp.o
[ 72%] Building CXX object CMakeFiles/hs_compile_shared.dir/src/parser/ComponentVisitor.cpp.o
[ 72%] Building CXX object CMakeFiles/hs_compile_shared.dir/src/parser/ComponentWordBoundary.cpp.o
[ 73%] Building CXX object CMakeFiles/hs_compile_shared.dir/src/parser/ConstComponentVisitor.cpp.o
[ 73%] Building CXX object CMakeFiles/hs_compile_shared.dir/src/parser/Parser.cpp.o
[ 73%] Building CXX object CMakeFiles/hs_compile_shared.dir/src/parser/Utf8ComponentClass.cpp.o
[ 74%] Building CXX object CMakeFiles/hs_compile_shared.dir/src/parser/buildstate.cpp.o
[ 74%] Building CXX object CMakeFiles/hs_compile_shared.dir/src/parser/check_refs.cpp.o
[ 74%] Building CXX object CMakeFiles/hs_compile_shared.dir/src/parser/control_verbs.cpp.o
[ 74%] Building CXX object CMakeFiles/hs_compile_shared.dir/src/parser/logical_combination.cpp.o
[ 75%] Building CXX object CMakeFiles/hs_compile_shared.dir/src/parser/parse_error.cpp.o
[ 75%] Building CXX object CMakeFiles/hs_compile_shared.dir/src/parser/parser_util.cpp.o
[ 75%] Building CXX object CMakeFiles/hs_compile_shared.dir/src/parser/prefilter.cpp.o
[ 76%] Building CXX object CMakeFiles/hs_compile_shared.dir/src/parser/shortcut_literal.cpp.o
[ 76%] Building CXX object CMakeFiles/hs_compile_shared.dir/src/parser/ucp_table.cpp.o
[ 76%] Building CXX object CMakeFiles/hs_compile_shared.dir/src/parser/unsupported.cpp.o
[ 77%] Building CXX object CMakeFiles/hs_compile_shared.dir/src/parser/utf8_validate.cpp.o
[ 77%] Building CXX object CMakeFiles/hs_compile_shared.dir/src/smallwrite/smallwrite_build.cpp.o
[ 77%] Building CXX object CMakeFiles/hs_compile_shared.dir/src/som/slot_manager.cpp.o
[ 77%] Building CXX object CMakeFiles/hs_compile_shared.dir/src/rose/rose_build_add.cpp.o
[ 78%] Building CXX object CMakeFiles/hs_compile_shared.dir/src/rose/rose_build_add_mask.cpp.o
[ 78%] Building CXX object CMakeFiles/hs_compile_shared.dir/src/rose/rose_build_anchored.cpp.o
[ 78%] Building CXX object CMakeFiles/hs_compile_shared.dir/src/rose/rose_build_bytecode.cpp.o
[ 79%] Building CXX object CMakeFiles/hs_compile_shared.dir/src/rose/rose_build_castle.cpp.o
[ 79%] Building CXX object CMakeFiles/hs_compile_shared.dir/src/rose/rose_build_compile.cpp.o
[ 79%] Building CXX object CMakeFiles/hs_compile_shared.dir/src/rose/rose_build_convert.cpp.o
[ 79%] Building CXX object CMakeFiles/hs_compile_shared.dir/src/rose/rose_build_dedupe.cpp.o
[ 80%] Building CXX object CMakeFiles/hs_compile_shared.dir/src/rose/rose_build_engine_blob.cpp.o
[ 80%] Building CXX object CMakeFiles/hs_compile_shared.dir/src/rose/rose_build_exclusive.cpp.o
[ 80%] Building CXX object CMakeFiles/hs_compile_shared.dir/src/rose/rose_build_groups.cpp.o
[ 81%] Building CXX object CMakeFiles/hs_compile_shared.dir/src/rose/rose_build_infix.cpp.o
[ 81%] Building CXX object CMakeFiles/hs_compile_shared.dir/src/rose/rose_build_instructions.cpp.o
[ 81%] Building CXX object CMakeFiles/hs_compile_shared.dir/src/rose/rose_build_lit_accel.cpp.o
[ 81%] Building CXX object CMakeFiles/hs_compile_shared.dir/src/rose/rose_build_long_lit.cpp.o
[ 82%] Building CXX object CMakeFiles/hs_compile_shared.dir/src/rose/rose_build_lookaround.cpp.o
[ 82%] Building CXX object CMakeFiles/hs_compile_shared.dir/src/rose/rose_build_matchers.cpp.o
[ 82%] Building CXX object CMakeFiles/hs_compile_shared.dir/src/rose/rose_build_merge.cpp.o
[ 83%] Building CXX object CMakeFiles/hs_compile_shared.dir/src/rose/rose_build_misc.cpp.o
[ 83%] Building CXX object CMakeFiles/hs_compile_shared.dir/src/rose/rose_build_program.cpp.o
[ 83%] Building CXX object CMakeFiles/hs_compile_shared.dir/src/rose/rose_build_role_aliasing.cpp.o
[ 83%] Building CXX object CMakeFiles/hs_compile_shared.dir/src/rose/rose_build_scatter.cpp.o
[ 84%] Building CXX object CMakeFiles/hs_compile_shared.dir/src/rose/rose_build_width.cpp.o
[ 84%] Building CXX object CMakeFiles/hs_compile_shared.dir/src/rose/rose_in_util.cpp.o
[ 84%] Building CXX object CMakeFiles/hs_compile_shared.dir/src/util/alloc.cpp.o
[ 85%] Building CXX object CMakeFiles/hs_compile_shared.dir/src/util/charreach.cpp.o
[ 85%] Building CXX object CMakeFiles/hs_compile_shared.dir/src/util/clique.cpp.o
[ 85%] Building CXX object CMakeFiles/hs_compile_shared.dir/src/util/compile_context.cpp.o
[ 85%] Building CXX object CMakeFiles/hs_compile_shared.dir/src/util/compile_error.cpp.o
[ 86%] Building CXX object CMakeFiles/hs_compile_shared.dir/src/util/depth.cpp.o
[ 86%] Building CXX object CMakeFiles/hs_compile_shared.dir/src/util/dump_mask.cpp.o
[ 86%] Building CXX object CMakeFiles/hs_compile_shared.dir/src/util/fatbit_build.cpp.o
[ 87%] Building CXX object CMakeFiles/hs_compile_shared.dir/src/util/multibit_build.cpp.o
[ 87%] Building CXX object CMakeFiles/hs_compile_shared.dir/src/util/report_manager.cpp.o
[ 87%] Building CXX object CMakeFiles/hs_compile_shared.dir/src/util/target_info.cpp.o
[ 88%] Building CXX object CMakeFiles/hs_compile_shared.dir/src/util/ue2string.cpp.o
make[3]: Leaving directory '/usr/src/hyperscan-5.4.0'
[ 88%] Built target hs_compile_shared
make[3]: Entering directory '/usr/src/hyperscan-5.4.0'
make[3]: Leaving directory '/usr/src/hyperscan-5.4.0'
make[3]: Entering directory '/usr/src/hyperscan-5.4.0'
[ 88%] Building C object CMakeFiles/hs_shared.dir/src/hs_version.c.o
[ 89%] Building C object CMakeFiles/hs_shared.dir/src/hs_valid_platform.c.o
[ 89%] Linking CXX shared library lib/libhs.so
make[3]: Leaving directory '/usr/src/hyperscan-5.4.0'
[ 89%] Built target hs_shared
make[3]: Entering directory '/usr/src/hyperscan-5.4.0'
make[3]: Entering directory '/usr/src/hyperscan-5.4.0'
make[3]: Entering directory '/usr/src/hyperscan-5.4.0'
make[3]: Entering directory '/usr/src/hyperscan-5.4.0'
make[3]: Entering directory '/usr/src/hyperscan-5.4.0'
make[3]: Entering directory '/usr/src/hyperscan-5.4.0'
make[3]: Leaving directory '/usr/src/hyperscan-5.4.0'
make[3]: Leaving directory '/usr/src/hyperscan-5.4.0'
make[3]: Leaving directory '/usr/src/hyperscan-5.4.0'
make[3]: Leaving directory '/usr/src/hyperscan-5.4.0'
make[3]: Leaving directory '/usr/src/hyperscan-5.4.0'
make[3]: Leaving directory '/usr/src/hyperscan-5.4.0'
make[3]: Entering directory '/usr/src/hyperscan-5.4.0'
make[3]: Entering directory '/usr/src/hyperscan-5.4.0'
make[3]: Entering directory '/usr/src/hyperscan-5.4.0'
make[3]: Entering directory '/usr/src/hyperscan-5.4.0'
make[3]: Entering directory '/usr/src/hyperscan-5.4.0'
make[3]: Entering directory '/usr/src/hyperscan-5.4.0'
[ 90%] Building CXX object tools/hscheck/CMakeFiles/hscheck.dir/main.cpp.o
[ 90%] Building CXX object examples/CMakeFiles/patbench.dir/patbench.cc.o
[ 90%] Building CXX object tools/hsbench/CMakeFiles/hsbench.dir/data_corpus.cpp.o
[ 92%] Building CXX object unit/CMakeFiles/unit-hyperscan.dir/gtest/gtest-all.cc.o
[ 92%] Building CXX object examples/CMakeFiles/pcapscan.dir/pcapscan.cc.o
[ 92%] Building C object examples/CMakeFiles/simplegrep.dir/simplegrep.c.o
[ 93%] Building CXX object tools/hsbench/CMakeFiles/hsbench.dir/engine.cpp.o
[ 93%] Linking C executable ../bin/simplegrep
/usr/bin/ld: ../lib/libhs.so.5.4.0: undefined reference to `avx2_memset'
/usr/bin/ld: ../lib/libhs.so.5.4.0: undefined reference to `core2_memcpy'
/usr/bin/ld: ../lib/libhs.so.5.4.0: undefined reference to `core2_memset'
/usr/bin/ld: ../lib/libhs.so.5.4.0: undefined reference to `core2_memmove'
/usr/bin/ld: ../lib/libhs.so.5.4.0: undefined reference to `avx2_memmove'
/usr/bin/ld: ../lib/libhs.so.5.4.0: undefined reference to `corei7_memset'
/usr/bin/ld: ../lib/libhs.so.5.4.0: undefined reference to `corei7_memcpy'
/usr/bin/ld: ../lib/libhs.so.5.4.0: undefined reference to `avx2_memcpy'
/usr/bin/ld: ../lib/libhs.so.5.4.0: undefined reference to `corei7_memmove'
collect2: error: ld returned 1 exit status
make[3]: *** [examples/CMakeFiles/simplegrep.dir/build.make:98: bin/simplegrep] Error 1
make[3]: Leaving directory '/usr/src/hyperscan-5.4.0'
make[2]: *** [CMakeFiles/Makefile2:799: examples/CMakeFiles/simplegrep.dir/all] Error 2
make[2]: *** Waiting for unfinished jobs....
[ 93%] Building CXX object tools/hsbench/CMakeFiles/hsbench.dir/engine_hyperscan.cpp.o
[ 93%] Linking CXX executable ../bin/patbench
[ 93%] Building CXX object unit/CMakeFiles/unit-hyperscan.dir/hyperscan/allocators.cpp.o
[ 93%] Building CXX object tools/hsbench/CMakeFiles/hsbench.dir/heapstats.cpp.o
[ 93%] Building CXX object unit/CMakeFiles/unit-hyperscan.dir/hyperscan/arg_checks.cpp.o
[ 93%] Building CXX object tools/hsbench/CMakeFiles/hsbench.dir/huge.cpp.o
[ 93%] Linking CXX executable ../../bin/hscheck
[ 94%] Building CXX object tools/hsbench/CMakeFiles/hsbench.dir/main.cpp.o
/usr/bin/ld: ../lib/libhs.so.5.4.0: undefined reference to `avx2_memset'
/usr/bin/ld: ../lib/libhs.so.5.4.0: undefined reference to `core2_memcpy'
/usr/bin/ld: ../lib/libhs.so.5.4.0: undefined reference to `core2_memset'
/usr/bin/ld: ../lib/libhs.so.5.4.0: undefined reference to `core2_memmove'
/usr/bin/ld: ../lib/libhs.so.5.4.0: undefined reference to `avx2_memmove'
/usr/bin/ld: ../lib/libhs.so.5.4.0: undefined reference to `corei7_memset'
/usr/bin/ld: ../lib/libhs.so.5.4.0: undefined reference to `corei7_memcpy'
/usr/bin/ld: ../lib/libhs.so.5.4.0: undefined reference to `avx2_memcpy'
/usr/bin/ld: ../lib/libhs.so.5.4.0: undefined reference to `corei7_memmove'
collect2: error: ld returned 1 exit status
make[3]: *** [examples/CMakeFiles/patbench.dir/build.make:98: bin/patbench] Error 1
make[3]: Leaving directory '/usr/src/hyperscan-5.4.0'
make[2]: *** [CMakeFiles/Makefile2:747: examples/CMakeFiles/patbench.dir/all] Error 2
[ 94%] Building CXX object tools/hsbench/CMakeFiles/hsbench.dir/sqldb.cpp.o
[ 94%] Linking CXX executable ../bin/pcapscan
[ 95%] Building CXX object unit/CMakeFiles/unit-hyperscan.dir/hyperscan/bad_patterns.cpp.o
/usr/bin/ld: ../../lib/libhs.so.5.4.0: undefined reference to `avx2_memset'
/usr/bin/ld: ../../lib/libhs.so.5.4.0: undefined reference to `core2_memcpy'
/usr/bin/ld: ../../lib/libhs.so.5.4.0: undefined reference to `core2_memset'
/usr/bin/ld: ../../lib/libhs.so.5.4.0: undefined reference to `core2_memmove'
/usr/bin/ld: ../../lib/libhs.so.5.4.0: undefined reference to `avx2_memmove'
/usr/bin/ld: ../../lib/libhs.so.5.4.0: undefined reference to `corei7_memset'
/usr/bin/ld: ../../lib/libhs.so.5.4.0: undefined reference to `corei7_memcpy'
/usr/bin/ld: ../../lib/libhs.so.5.4.0: undefined reference to `avx2_memcpy'
/usr/bin/ld: ../../lib/libhs.so.5.4.0: undefined reference to `corei7_memmove'
collect2: error: ld returned 1 exit status
make[3]: *** [tools/hscheck/CMakeFiles/hscheck.dir/build.make:99: bin/hscheck] Error 1
make[3]: Leaving directory '/usr/src/hyperscan-5.4.0'
make[2]: *** [CMakeFiles/Makefile2:721: tools/hscheck/CMakeFiles/hscheck.dir/all] Error 2
[ 95%] Building CXX object unit/CMakeFiles/unit-hyperscan.dir/hyperscan/behaviour.cpp.o
[ 95%] Building CXX object unit/CMakeFiles/unit-hyperscan.dir/hyperscan/expr_info.cpp.o
/usr/bin/ld: ../lib/libhs.so.5.4.0: undefined reference to `avx2_memset'
/usr/bin/ld: ../lib/libhs.so.5.4.0: undefined reference to `core2_memcpy'
/usr/bin/ld: ../lib/libhs.so.5.4.0: undefined reference to `core2_memset'
/usr/bin/ld: ../lib/libhs.so.5.4.0: undefined reference to `core2_memmove'
/usr/bin/ld: ../lib/libhs.so.5.4.0: undefined reference to `avx2_memmove'
/usr/bin/ld: ../lib/libhs.so.5.4.0: undefined reference to `corei7_memset'
/usr/bin/ld: ../lib/libhs.so.5.4.0: undefined reference to `corei7_memcpy'
/usr/bin/ld: ../lib/libhs.so.5.4.0: undefined reference to `avx2_memcpy'
/usr/bin/ld: ../lib/libhs.so.5.4.0: undefined reference to `corei7_memmove'
collect2: error: ld returned 1 exit status
make[3]: *** [examples/CMakeFiles/pcapscan.dir/build.make:98: bin/pcapscan] Error 1
make[3]: Leaving directory '/usr/src/hyperscan-5.4.0'
make[2]: *** [CMakeFiles/Makefile2:773: examples/CMakeFiles/pcapscan.dir/all] Error 2
[ 95%] Building CXX object unit/CMakeFiles/unit-hyperscan.dir/hyperscan/extparam.cpp.o
[ 96%] Building CXX object unit/CMakeFiles/unit-hyperscan.dir/hyperscan/identical.cpp.o
[ 96%] Building CXX object unit/CMakeFiles/unit-hyperscan.dir/hyperscan/literals.cpp.o
[ 96%] Building CXX object unit/CMakeFiles/unit-hyperscan.dir/hyperscan/logical_combination.cpp.o
[ 97%] Building CXX object unit/CMakeFiles/unit-hyperscan.dir/hyperscan/main.cpp.o
[ 97%] Building CXX object unit/CMakeFiles/unit-hyperscan.dir/hyperscan/multi.cpp.o
[ 97%] Building CXX object unit/CMakeFiles/unit-hyperscan.dir/hyperscan/order.cpp.o
[ 97%] Building CXX object unit/CMakeFiles/unit-hyperscan.dir/hyperscan/scratch_op.cpp.o
[ 98%] Building CXX object unit/CMakeFiles/unit-hyperscan.dir/hyperscan/scratch_in_use.cpp.o
[ 98%] Building CXX object unit/CMakeFiles/unit-hyperscan.dir/hyperscan/serialize.cpp.o
[ 98%] Linking CXX executable ../../bin/hsbench
[ 98%] Building CXX object unit/CMakeFiles/unit-hyperscan.dir/hyperscan/single.cpp.o
[ 99%] Building CXX object unit/CMakeFiles/unit-hyperscan.dir/hyperscan/som.cpp.o
[ 99%] Building CXX object unit/CMakeFiles/unit-hyperscan.dir/hyperscan/stream_op.cpp.o
[ 99%] Building CXX object unit/CMakeFiles/unit-hyperscan.dir/hyperscan/test_util.cpp.o
/usr/bin/ld: ../../lib/libhs.so.5.4.0: undefined reference to `avx2_memset'
/usr/bin/ld: ../../lib/libhs.so.5.4.0: undefined reference to `core2_memcpy'
/usr/bin/ld: ../../lib/libhs.so.5.4.0: undefined reference to `core2_memset'
/usr/bin/ld: ../../lib/libhs.so.5.4.0: undefined reference to `core2_memmove'
/usr/bin/ld: ../../lib/libhs.so.5.4.0: undefined reference to `avx2_memmove'
/usr/bin/ld: ../../lib/libhs.so.5.4.0: undefined reference to `corei7_memset'
/usr/bin/ld: ../../lib/libhs.so.5.4.0: undefined reference to `corei7_memcpy'
/usr/bin/ld: ../../lib/libhs.so.5.4.0: undefined reference to `avx2_memcpy'
/usr/bin/ld: ../../lib/libhs.so.5.4.0: undefined reference to `corei7_memmove'
collect2: error: ld returned 1 exit status
make[3]: *** [tools/hsbench/CMakeFiles/hsbench.dir/build.make:196: bin/hsbench] Error 1
make[3]: Leaving directory '/usr/src/hyperscan-5.4.0'
make[2]: *** [CMakeFiles/Makefile2:694: tools/hsbench/CMakeFiles/hsbench.dir/all] Error 2
[100%] Linking CXX executable ../bin/unit-hyperscan
/usr/bin/ld: ../lib/libhs.so.5.4.0: undefined reference to `avx2_memset'
/usr/bin/ld: ../lib/libhs.so.5.4.0: undefined reference to `core2_memcpy'
/usr/bin/ld: ../lib/libhs.so.5.4.0: undefined reference to `core2_memset'
/usr/bin/ld: ../lib/libhs.so.5.4.0: undefined reference to `core2_memmove'
/usr/bin/ld: ../lib/libhs.so.5.4.0: undefined reference to `avx2_memmove'
/usr/bin/ld: ../lib/libhs.so.5.4.0: undefined reference to `corei7_memset'
/usr/bin/ld: ../lib/libhs.so.5.4.0: undefined reference to `corei7_memcpy'
/usr/bin/ld: ../lib/libhs.so.5.4.0: undefined reference to `avx2_memcpy'
/usr/bin/ld: ../lib/libhs.so.5.4.0: undefined reference to `corei7_memmove'
collect2: error: ld returned 1 exit status
make[3]: *** [unit/CMakeFiles/unit-hyperscan.dir/build.make:403: bin/unit-hyperscan] Error 1
make[3]: Leaving directory '/usr/src/hyperscan-5.4.0'
make[2]: *** [CMakeFiles/Makefile2:666: unit/CMakeFiles/unit-hyperscan.dir/all] Error 2
make[2]: Leaving directory '/usr/src/hyperscan-5.4.0'
make[1]: *** [Makefile:136: all] Error 2
make[1]: Leaving directory '/usr/src/hyperscan-5.4.0'
make: *** [hyperscan:80: /usr/src/log/hyperscan-5.4.0] Error 2

             reply	other threads:[~2021-04-17 14:11 UTC|newest]

Thread overview: 10+ messages / expand[flat|nested]  mbox.gz  Atom feed  top
2021-04-17 14:11 Adolf Belka [this message]
2021-04-17 20:53 ` Adolf Belka
2021-04-19  9:55   ` Michael Tremer
2021-04-20 17:30     ` Adolf Belka
     [not found] <9e299f6ca9e27efdde6ef0ae532cba63@web.de>
2021-04-21 13:42 ` Adolf Belka
2021-04-21 13:57   ` Adolf Belka
2021-04-21 14:23     ` Michael Tremer
2021-04-21 15:50       ` Adolf Belka
2021-04-21 15:52         ` Michael Tremer
2021-04-21 21:14           ` Adolf Belka

Reply instructions:

You may reply publicly to this message via plain-text email
using any one of the following methods:

* Save the following mbox file, import it into your mail client,
  and reply-to-all from there: mbox

  Avoid top-posting and favor interleaved quoting:
  https://en.wikipedia.org/wiki/Posting_style#Interleaved_style

* Reply using the --to, --cc, and --in-reply-to
  switches of git-send-email(1):

  git send-email \
    --in-reply-to=b2513778-4038-5c1e-249d-d452930a1c73@ipfire.org \
    --to=adolf.belka@ipfire.org \
    --cc=development@lists.ipfire.org \
    /path/to/YOUR_REPLY

  https://kernel.org/pub/software/scm/git/docs/git-send-email.html

* If your mail client supports setting the In-Reply-To header
  via mailto: links, try the mailto: link
Be sure your reply has a Subject: header at the top and a blank line before the message body.
This is a public inbox, see mirroring instructions
for how to clone and mirror all data and code used for this inbox