Hyperscan crashes in build process

Michael Tremer michael.tremer at ipfire.org
Wed Jun 5 17:31:52 BST 2019


How much memory does your build machine have?

> On 5 Jun 2019, at 16:40, ummeegge <ummeegge at ipfire.org> wrote:
> 
> Hi all,
> just wanted to report that Hyperscan quits in the current origin/next
> build process with
> 
> [ 78%] Building CXX object CMakeFiles/hs_compile_shared.dir/src/rose/rose_build_castle.cpp.o
> c++: fatal error: Killed signal terminated program cc1plus
> compilation terminated.
> make[3]: *** [CMakeFiles/hs_compile_shared.dir/build.make:1698: CMakeFiles/hs_compile_shared.dir/src/rose/rose_build_bytecode.cpp.o] Error 1
> make[3]: *** Deleting file 'CMakeFiles/hs_compile_shared.dir/src/rose/rose_build_bytecode.cpp.o'
> make[3]: *** Waiting for unfinished jobs....
> make[3]: Leaving directory '/usr/src/hyperscan-5.1.1'
> make[2]: *** [CMakeFiles/Makefile2:251: CMakeFiles/hs_compile_shared.dir/all] Error 2
> make[2]: Leaving directory '/usr/src/hyperscan-5.1.1'
> make[1]: *** [Makefile:130: all] Error 2
> make[1]: Leaving directory '/usr/src/hyperscan-5.1.1'
> make: *** [hyperscan:80: /usr/src/log/hyperscan-5.1.1] Error 2
> 
> Best,
> 
> Erik
> 
> 
> 



More information about the Development mailing list